Reaction Details
TargetTGF-beta receptor type-1
LigandBDBM50252542
Substrate/Competitorn/a
Meas. Tech.ChEMBL_639063 (CHEMBL1166316)
IC50 36±n/a nM
Citation Kim, DKLee, YILee, YWDewang, PMSheen, YYKim, YWPark, HJYoo, JLee, HSKim, YK Synthesis and biological evaluation of 4(5)-(6-methylpyridin-2-yl)imidazoles and -pyrazoles as transforming growth factor-beta type 1 receptor kinase inhibitors. Bioorg Med Chem18:4459-67 (2010) 
 
TGF-beta receptor type-1
Name:TGF-beta receptor type-1
Type:enzyme
Mol. Mass.:55968.24
Organism:Homo sapiens (Human)
Description:P36897
Residue:503
BDBM50252542
NameBDBM50252542
Synonyms:3-((5-(6-methylpyridin-2-yl)-4-(quinoxalin-6-yl)-1H-imidazol-2-yl)methyl)benzamide IN-1130
TypeSmall organic molecule
Emp. Form.C25H20N6O
Mol. Mass.420.4659
SMILESCc1cccc(n1)-c1nc(Cc2cccc(c2)C(N)=O)[nH]c1-c1ccc2nccnc2c1