Reaction Details
Target3-hydroxy-3-methylglutaryl-coenzyme A reductase
LigandBDBM50226170
Substrate/Competitorn/a
Meas. Tech.ChEMBL_637422 (CHEMBL1166355)
IC50 44810±n/a nM
Citation Pak, VVKoo, MKwon, DYShakhidoyatov, KMYun, L Peptide fragmentation as an approach in modeling of an active peptide and designing a competitive inhibitory peptide for HMG-CoA reductase. Bioorg Med Chem18:4300-9 (2010) 
 
3-hydroxy-3-methylglutaryl-coenzyme A reductase
Name:3-hydroxy-3-methylglutaryl-coenzyme A reductase
Type:Enzyme
Mol. Mass.:97477.10
Organism:Homo sapiens (Human)
Description:P04035
Residue:888
BDBM50226170
NameBDBM50226170
Synonyms:CHEMBL409841 | YAVE
TypeSmall organic molecule
Emp. Form.C22H32N4O8
Mol. Mass.480.5115
SMILESCC(C)[C@H](NC(=O)[C@H](C)NC(=O)[C@@H](N)Cc1ccc(O)cc1)C(=O)N[C@@H](CCC(O)=O)C(O)=O