Reaction Details
TargetThermolysin
LigandBDBM50321113
Substrate/Competitorn/a
Meas. Tech.ChEMBL_637433 (CHEMBL1166366)
IC50 11.5±n/a nM
Citation Khan, MTKhan, RWuxiuer, YArfan, MAhmed, MSylte, I Identification of novel quinazolin-4(3H)-ones as inhibitors of thermolysin, the prototype of the M4 family of proteinases. Bioorg Med Chem18:4317-27 (2010) 
 
Thermolysin
Name:Thermolysin
Type:PROTEIN
Mol. Mass.:60097.54
Organism:Bacillus thermoproteolyticus
Description:ChEMBL_1468794
Residue:548
BDBM50321113
NameBDBM50321113
Synonyms:3-Phenyl-2-(trifluoromethyl)quinazolin-4(3H)-one | CHEMBL1164452
TypeSmall organic molecule
Emp. Form.C15H9F3N2O
Mol. Mass.290.24
SMILESFC(F)(F)c1nc2ccccc2c(=O)n1-c1ccccc1