Reaction Details
TargetThermolysin
LigandBDBM50321122
Substrate/Competitorn/a
Meas. Tech.ChEMBL_637433 (CHEMBL1166366)
IC50 1250±n/a nM
Citation Khan, MTKhan, RWuxiuer, YArfan, MAhmed, MSylte, I Identification of novel quinazolin-4(3H)-ones as inhibitors of thermolysin, the prototype of the M4 family of proteinases. Bioorg Med Chem18:4317-27 (2010) 
 
Thermolysin
Name:Thermolysin
Type:PROTEIN
Mol. Mass.:60097.54
Organism:Bacillus thermoproteolyticus
Description:ChEMBL_1468794
Residue:548
BDBM50321122
NameBDBM50321122
Synonyms:2-Ethylquinazolin-4(3H)-one | CHEMBL1163173
TypeSmall organic molecule
Emp. Form.C14H9ClN2O
Mol. Mass.256.687
SMILESClc1ccc(cc1)-c1nc2ccccc2c(=O)[nH]1