Reaction Details
TargetD(1A) dopamine receptor
LigandBDBM50322374
Substrate/Competitorn/a
Meas. Tech.ChEMBL_643050 (CHEMBL1176241)
Ki>1000±n/a nM
Citation Butini, SCampiani, GFranceschini, STrotta, FKumar, VGuarino, EBorrelli, GFiorini, INovellino, EFattorusso, CPersico, MOrteca, NSandager-Nielsen, KJacobsen, TAMadsen, KScheel-Kruger, JGemma, S Discovery of bishomo(hetero)arylpiperazines as novel multifunctional ligands targeting dopamine D(3) and serotonin 5-HT(1A) and 5-HT(2A) receptors. J Med Chem53:4803-7 (2010) 
 
D(1A) dopamine receptor
Name:D(1A) dopamine receptor
Type:Enzyme Catalytic Domain
Mol. Mass.:49429.75
Organism:RAT
Description:P18901
Residue:446
BDBM50322374
NameBDBM50322374
Synonyms:1,6-bis(4-phenylpiperazin-1-yl)hexane | CHEMBL1172205
TypeSmall organic molecule
Emp. Form.C26H38N4
Mol. Mass.406.6067
SMILESC(CCCN1CCN(CC1)c1ccccc1)CCN1CCN(CC1)c1ccccc1