Reaction Details
TargetProstaglandin G/H synthase 2
LigandBDBM50322615
Substrate/Competitorn/a
Meas. Tech.ChEMBL_642022 (CHEMBL1176361)
IC50 7530±n/a nM
Citation Hoshino, JPark, EJKondratyuk, TPMarler, LPezzuto, JMvan Breemen, RBMo, SLi, YCushman, M Selective synthesis and biological evaluation of sulfate-conjugated resveratrol metabolites. J Med Chem53:5033-43 (2010) 
 
Prostaglandin G/H synthase 2
Name:Prostaglandin G/H synthase 2
Type:Enzyme
Mol. Mass.:69003.89
Organism:Homo sapiens (Human)
Description:Recombinant Cox-2 provided by Cayman (Cayman Chemical Co.,Ann Arbor, MI).
Residue:604
BDBM50322615
NameBDBM50322615
Synonyms:CHEMBL1173685 Resveratrol Potassium3-Sulfate
TypeSmall organic molecule
Emp. Form.C14H11O6S
Mol. Mass.307.299
SMILESOc1ccc(\C=C\c2cc(O)cc(OS([O-])(=O)=O)c2)cc1