Reaction Details
TargetB1 bradykinin receptor
LigandBDBM50322863
Substrate/Competitorn/a
Meas. Tech.ChEMBL_644658 (CHEMBL1211637)
Ki 21±n/a nM
Citation Liu, QQian, WLi, ABiswas, KChen, JJFotsch, CHan, NYuan, CArik, LBiddlecome, GJohnson, EKumar, GLester-Zeiner, DNg, GYHungate, RWAskew, BC Aryl sulfonamides containing tetralin allylic amines as potent and selective bradykinin B1 receptor antagonists. Bioorg Med Chem Lett20:4593-7 (2010) 
 
B1 bradykinin receptor
Name:B1 bradykinin receptor
Type:Enzyme
Mol. Mass.:40508.87
Organism:Homo sapiens (Human)
Description:P46663
Residue:353
BDBM50322863
NameBDBM50322863
Synonyms:(R)-N-((R)-6-(3-(2-hydroxyethylamino)prop-1-en-2-yl)-1,2,3,4-tetrahydronaphthalen-1-yl)-3-phenyl-3-(3-(trifluoromethyl)phenylsulfonamido)propanamide | CHEMBL1210749
TypeSmall organic molecule
Emp. Form.C31H34F3N3O4S
Mol. Mass.601.68
SMILESOCCNCC(=C)c1ccc2[C@@H](CCCc2c1)NC(=O)C[C@@H](NS(=O)(=O)c1cccc(c1)C(F)(F)F)c1ccccc1