Reaction Details
TargetHydroxycarboxylic acid receptor 2
LigandBDBM23515
Substrate/Competitorn/a
Meas. Tech.ChEMBL_644014 (CHEMBL1211913)
IC50 140±n/a nM
Citation Imbriglio, JEChang, SLiang, RRaghavan, SSchmidt, DSmenton, ATria, SSchrader, TOJung, JKEsser, CHolt, TGWolff, MSTaggart, AKCheng, KCarballo-Jane, EWaters, MGTata, JRColletti, SL GPR109a agonists. Part 2: pyrazole-acids as agonists of the human orphan G-protein coupled receptor GPR109a. Bioorg Med Chem Lett20:4472-4 (2010) 
 
Hydroxycarboxylic acid receptor 2
Name:Hydroxycarboxylic acid receptor 2
Type:PROTEIN
Mol. Mass.:41418.01
Organism:Mus musculus
Description:ChEMBL_820676
Residue:360
BDBM23515
NameBDBM23515
Synonyms:CHEMBL573 Nicotinic Acid pyridine-3-carboxylic acid | wampocap
TypeSmall organic molecule
Emp. Form.C6H5NO2
Mol. Mass.123.1094
SMILESOC(=O)c1cccnc1