Reaction Details
TargetHydroxycarboxylic acid receptor 2
LigandBDBM50273099
Substrate/Competitorn/a
Meas. Tech.ChEMBL_644014 (CHEMBL1211913)
IC50 1200±n/a nM
Citation Imbriglio, JEChang, SLiang, RRaghavan, SSchmidt, DSmenton, ATria, SSchrader, TOJung, JKEsser, CHolt, TGWolff, MSTaggart, AKCheng, KCarballo-Jane, EWaters, MGTata, JRColletti, SL GPR109a agonists. Part 2: pyrazole-acids as agonists of the human orphan G-protein coupled receptor GPR109a. Bioorg Med Chem Lett20:4472-4 (2010) 
 
Hydroxycarboxylic acid receptor 2
Name:Hydroxycarboxylic acid receptor 2
Type:PROTEIN
Mol. Mass.:41418.01
Organism:Mus musculus
Description:ChEMBL_820676
Residue:360
BDBM50273099
NameBDBM50273099
Synonyms:3-(1H-tetrazol-5-yl)-1,4,5,6-tetrahydrocyclopenta[c]pyrazole CHEMBL456145 | MK-0354
TypeSmall organic molecule
Emp. Form.C7H8N6
Mol. Mass.176.1786
SMILESC1Cc2[nH]nc(c2C1)-c1nnn[nH]1