Reaction Details
TargetHydroxycarboxylic acid receptor 2
LigandBDBM50323392
Substrate/Competitorn/a
Meas. Tech.ChEMBL_644014 (CHEMBL1211913)
IC50 1100±n/a nM
Citation Imbriglio, JEChang, SLiang, RRaghavan, SSchmidt, DSmenton, ATria, SSchrader, TOJung, JKEsser, CHolt, TGWolff, MSTaggart, AKCheng, KCarballo-Jane, EWaters, MGTata, JRColletti, SL GPR109a agonists. Part 2: pyrazole-acids as agonists of the human orphan G-protein coupled receptor GPR109a. Bioorg Med Chem Lett20:4472-4 (2010) 
 
Hydroxycarboxylic acid receptor 2
Name:Hydroxycarboxylic acid receptor 2
Type:PROTEIN
Mol. Mass.:41418.01
Organism:Mus musculus
Description:ChEMBL_820676
Residue:360
BDBM50323392
NameBDBM50323392
Synonyms:5-sec-butyl-1,4,5,6-tetrahydrocyclopenta[c]pyrazole-3-carboxylic acid | CHEMBL1208921
TypeSmall organic molecule
Emp. Form.C11H16N2O2
Mol. Mass.208.2569
SMILESCCC(C)C1Cc2[nH]nc(C(O)=O)c2C1