Reaction Details
TargetHydroxycarboxylic acid receptor 2
LigandBDBM50323400
Substrate/Competitorn/a
Meas. Tech.ChEMBL_644014 (CHEMBL1211913)
IC50 5200±n/a nM
Citation Imbriglio, JEChang, SLiang, RRaghavan, SSchmidt, DSmenton, ATria, SSchrader, TOJung, JKEsser, CHolt, TGWolff, MSTaggart, AKCheng, KCarballo-Jane, EWaters, MGTata, JRColletti, SL GPR109a agonists. Part 2: pyrazole-acids as agonists of the human orphan G-protein coupled receptor GPR109a. Bioorg Med Chem Lett20:4472-4 (2010) 
 
Hydroxycarboxylic acid receptor 2
Name:Hydroxycarboxylic acid receptor 2
Type:PROTEIN
Mol. Mass.:41418.01
Organism:Mus musculus
Description:ChEMBL_820676
Residue:360
BDBM50323400
NameBDBM50323400
Synonyms:5-(1H-1,2,3-triazol-1-yl)-1,4,5,6-tetrahydrocyclopenta[c]pyrazole-3-carboxylic acid | CHEMBL1208988
TypeSmall organic molecule
Emp. Form.C9H9N5O2
Mol. Mass.219.2001
SMILESOC(=O)c1n[nH]c2CC(Cc12)n1ccnn1