Reaction Details
TargetHydroxycarboxylic acid receptor 2
LigandBDBM50323390
Substrate/Competitorn/a
Meas. Tech.ChEMBL_644015 (CHEMBL1211914)
IC50 380±n/a nM
Citation Imbriglio, JEChang, SLiang, RRaghavan, SSchmidt, DSmenton, ATria, SSchrader, TOJung, JKEsser, CHolt, TGWolff, MSTaggart, AKCheng, KCarballo-Jane, EWaters, MGTata, JRColletti, SL GPR109a agonists. Part 2: pyrazole-acids as agonists of the human orphan G-protein coupled receptor GPR109a. Bioorg Med Chem Lett20:4472-4 (2010) 
 
Hydroxycarboxylic acid receptor 2
Name:Hydroxycarboxylic acid receptor 2
Type:G Protein-Coupled Receptor (GPCR)
Mol. Mass.:41868.22
Organism:Homo sapiens (Human)
Description:Membranes from CHO cells expressing the recombinant human GPR109A were used in competition binding assay.
Residue:363
BDBM50323390
NameBDBM50323390
Synonyms:5-propyl-1,4,5,6-tetrahydrocyclopenta[c]pyrazole-3-carboxylic acid | CHEMBL1208919
TypeSmall organic molecule
Emp. Form.C10H14N2O2
Mol. Mass.194.2304
SMILESCCCC1Cc2[nH]nc(C(O)=O)c2C1