Reaction Details
TargetNeuropeptide Y receptor type 5
LigandBDBM50416460
Substrate/Competitorn/a
Meas. Tech.ChEMBL_644140 (CHEMBL1212039)
Ki 0.631±n/a nM
Citation Biagetti, MLeslie, CPMazzali, ASeri, CPizzi, DABentley, JGenski, TDi Fabio, RZonzini, LCaberlotto, L Synthesis and structure-activity relationship of N-(3-azabicyclo[3.1.0]hex-6-ylmethyl)-5-(2-pyridinyl)-1,3-thiazol-2-amines derivatives as NPY Y5 antagonists. Bioorg Med Chem Lett20:4741-4 (2010) 
 
Neuropeptide Y receptor type 5
Name:Neuropeptide Y receptor type 5
Type:Enzyme
Mol. Mass.:50746.64
Organism:Homo sapiens (Human)
Description:Q15761
Residue:445
BDBM50416460
NameBDBM50416460
Synonyms:CHEMBL1209345
TypeSmall organic molecule
Emp. Form.C21H20F2N4S
Mol. Mass.398.472
SMILESFc1cc(F)cc(CN2C[C@H]3[C@@H](CNc4nc(cs4)-c4ccccn4)[C@H]3C2)c1