Reaction Details
TargetPlasmepsin II
LigandBDBM50323737
Substrate/Competitorn/a
Meas. Tech.ChEMBL_646946 (CHEMBL1217087)
IC50 0.59±n/a nM
Citation Kaur, KJain, MReddy, RPJain, R Quinolines and structurally related heterocycles as antimalarials. Eur J Med Chem45:3245-64 (2010) 
 
Plasmepsin II
Name:Plasmepsin II
Type:Enzyme
Mol. Mass.:51482.09
Organism:Plasmodium falciparum
Description:P46925
Residue:453
BDBM50323737
NameBDBM50323737
Synonyms:CHEMBL1213687 | N-((2S)-1-((2S)-6-amino-1-(4-(6-methoxyquinolin-8-ylamino)pentylamino)-1-oxohexan-2-ylamino)-4-methyl-1-oxopentan-2-yl)-4-(4-((2S,3S)-1-((3S,4S)-1-(butylamino)-3-hydroxy-6-methyl-1-oxoheptan-4-ylamino)-3-methyl-1-oxopentan-2-ylcarbamoyl)phenoxy)benzamide
TypeSmall organic molecule
Emp. Form.C59H87N9O9
Mol. Mass.1066.377
SMILESCCCCNC(=O)C[C@H](O)[C@H](CC(C)C)NC(=O)[C@@H](NC(=O)c1ccc(Oc2ccc(cc2)C(=O)N[C@@H](CC(C)C)C(=O)N[C@@H](CCCCN)C(=O)NCCCC(C)Nc2cc(OC)cc3cccnc23)cc1)[C@@H](C)CC