Reaction Details
TargetHistone-lysine N-methyltransferase EHMT2
LigandBDBM50323810
Substrate/Competitorn/a
Meas. Tech.ChEMBL_647515 (CHEMBL1217455)
IC50 880000±n/a nM
Citation Liu, FChen, XAllali-Hassani, AQuinn, AMWigle, TJWasney, GADong, ASenisterra, GChau, ISiarheyeva, ANorris, JLKireev, DBJadhav, AHerold, JMJanzen, WPArrowsmith, CHFrye, SVBrown, PJSimeonov, AVedadi, MJin, J Protein lysine methyltransferase G9a inhibitors: design, synthesis, and structure activity relationships of 2,4-diamino-7-aminoalkoxy-quinazolines. J Med Chem53:5844-57 (2010) 
 
Histone-lysine N-methyltransferase EHMT2
Name:Histone-lysine N-methyltransferase EHMT2
Type:Enzyme
Mol. Mass.:132339.87
Organism:Homo sapiens (Human)
Description:Q96KQ7
Residue:1210
BDBM50323810
NameBDBM50323810
Synonyms:6-Methoxy-2-(4-methyl-1,4-diazepan-1-yl)-N-(1-methylpiperidin-4-yl)-7-(3-morpholinopropoxy)quinazolin-4-amine | CHEMBL1213958
TypeSmall organic molecule
Emp. Form.C28H45N7O3
Mol. Mass.527.702
SMILESCOc1cc2c(NC3CCN(C)CC3)nc(nc2cc1OCCCN1CCOCC1)N1CCCN(C)CC1