Reaction Details
TargetHistone-lysine N-methyltransferase EHMT2
LigandBDBM50300028
Substrate/Competitorn/a
Meas. Tech.ChEMBL_647515 (CHEMBL1217455)
IC50 180000±n/a nM
Citation Liu, FChen, XAllali-Hassani, AQuinn, AMWigle, TJWasney, GADong, ASenisterra, GChau, ISiarheyeva, ANorris, JLKireev, DBJadhav, AHerold, JMJanzen, WPArrowsmith, CHFrye, SVBrown, PJSimeonov, AVedadi, MJin, J Protein lysine methyltransferase G9a inhibitors: design, synthesis, and structure activity relationships of 2,4-diamino-7-aminoalkoxy-quinazolines. J Med Chem53:5844-57 (2010) 
 
Histone-lysine N-methyltransferase EHMT2
Name:Histone-lysine N-methyltransferase EHMT2
Type:Enzyme
Mol. Mass.:132339.87
Organism:Homo sapiens (Human)
Description:Q96KQ7
Residue:1210
BDBM50300028
NameBDBM50300028
Synonyms:CHEMBL569864 | N-(1-benzylpiperidin-4-yl)-6,7-dimethoxy-2-(4-methyl-1,4-diazepan-1-yl)quinazolin-4-amine
TypeSmall organic molecule
Emp. Form.C28H38N6O2
Mol. Mass.490.6403
SMILESCOc1cc2nc(nc(NC3CCN(Cc4ccccc4)CC3)c2cc1OC)N1CCCN(C)CC1