Reaction Details
TargetHistone-lysine N-methyltransferase EHMT2
LigandBDBM50323817
Substrate/Competitorn/a
Meas. Tech.ChEMBL_647513 (CHEMBL1217453)
IC50>10000000±n/a nM
Citation Liu, FChen, XAllali-Hassani, AQuinn, AMWigle, TJWasney, GADong, ASenisterra, GChau, ISiarheyeva, ANorris, JLKireev, DBJadhav, AHerold, JMJanzen, WPArrowsmith, CHFrye, SVBrown, PJSimeonov, AVedadi, MJin, J Protein lysine methyltransferase G9a inhibitors: design, synthesis, and structure activity relationships of 2,4-diamino-7-aminoalkoxy-quinazolines. J Med Chem53:5844-57 (2010) 
 
Histone-lysine N-methyltransferase EHMT2
Name:Histone-lysine N-methyltransferase EHMT2
Type:Enzyme
Mol. Mass.:132339.87
Organism:Homo sapiens (Human)
Description:Q96KQ7
Residue:1210
BDBM50323817
NameBDBM50323817
Synonyms:6,7-Dimethoxy-N-methyl-2-(4-methyl-1,4-diazepan-1-yl)-N-(1-methylpiperidin-4-yl)quinazolin-4-amine | CHEMBL1214628
TypeSmall organic molecule
Emp. Form.C23H36N6O2
Mol. Mass.428.5709
SMILESCOc1cc2nc(nc(N(C)C3CCN(C)CC3)c2cc1OC)N1CCCN(C)CC1