Reaction Details
TargetHistone-lysine N-methyltransferase EHMT2
LigandBDBM50300041
Substrate/Competitorn/a
Meas. Tech.ChEMBL_647518 (CHEMBL1217458)
Kd 23±n/a nM
Citation Liu, FChen, XAllali-Hassani, AQuinn, AMWigle, TJWasney, GADong, ASenisterra, GChau, ISiarheyeva, ANorris, JLKireev, DBJadhav, AHerold, JMJanzen, WPArrowsmith, CHFrye, SVBrown, PJSimeonov, AVedadi, MJin, J Protein lysine methyltransferase G9a inhibitors: design, synthesis, and structure activity relationships of 2,4-diamino-7-aminoalkoxy-quinazolines. J Med Chem53:5844-57 (2010) 
 
Histone-lysine N-methyltransferase EHMT2
Name:Histone-lysine N-methyltransferase EHMT2
Type:Enzyme
Mol. Mass.:132339.87
Organism:Homo sapiens (Human)
Description:Q96KQ7
Residue:1210
BDBM50300041
NameBDBM50300041
Synonyms:7-(3-(dimethylamino)propoxy)-6-methoxy-2-(4-methyl-1,4-diazepan-1-yl)-N-(1-methylpiperidin-4-yl)quinazolin-4-amine CHEMBL576781 | UNC0224
TypeSmall organic molecule
Emp. Form.C26H43N7O2
Mol. Mass.485.6653
SMILESCOc1cc2c(NC3CCN(C)CC3)nc(nc2cc1OCCCN(C)C)N1CCCN(C)CC1