Reaction Details
TargetProthrombin
LigandBDBM50324475
Substrate/Competitorn/a
Meas. Tech.ChEMBL_649223 (CHEMBL1218921)
Ki 1.94±n/a nM
Citation Sisay, MTSteinmetzer, TStirnberg, MMaurer, EHammami, MBajorath, JGütschow, M Identification of the first low-molecular-weight inhibitors of matriptase-2. J Med Chem53:5523-35 (2010) 
 
Prothrombin
Name:Prothrombin
Type:Protein
Mol. Mass.:70029.57
Organism:Homo sapiens (Human)
Description:P00734
Residue:622
BDBM50324475
NameBDBM50324475
Synonyms:Benzylsulfonyl-D-argininyl-proline-(4-amidinobenzyl)amide Bis-(trifluoroacetate) CHEMBL1229259
TypeSmall organic molecule
Emp. Form.C26H36N8O4S
Mol. Mass.556.68
SMILESNC(=N)NCCC[C@@H](NS(=O)(=O)Cc1ccccc1)C(=O)N1CCC[C@H]1C(=O)NCc1ccc(cc1)C(N)=N