Reaction Details
TargetProthrombin
LigandBDBM50324478
Substrate/Competitorn/a
Meas. Tech.ChEMBL_649223 (CHEMBL1218921)
Ki 0.108±n/a nM
Citation Sisay, MTSteinmetzer, TStirnberg, MMaurer, EHammami, MBajorath, JGütschow, M Identification of the first low-molecular-weight inhibitors of matriptase-2. J Med Chem53:5523-35 (2010) 
 
Prothrombin
Name:Prothrombin
Type:Protein
Mol. Mass.:70029.57
Organism:Homo sapiens (Human)
Description:P00734
Residue:622
BDBM50324478
NameBDBM50324478
Synonyms:Benzylsulfonyl-D-cyclohexylalanyl-proline-(2-aminomethyl-5-chlorobenzyl)amide Trifluoroacetate CHEMBL1229262
TypeSmall organic molecule
Emp. Form.C29H39ClN4O4S
Mol. Mass.575.162
SMILESNCc1ccc(Cl)cc1CNC(=O)[C@@H]1CCCN1C(=O)[C@@H](CC1CCCCC1)NS(=O)(=O)Cc1ccccc1