Reaction Details
TargetHematopoietic prostaglandin D synthase
LigandBDBM50324480
Substrate/Competitorn/a
Meas. Tech.ChEMBL_649226 (CHEMBL1218924)
IC50 1200±n/a nM
Citation Christ, ANLabzin, LBourne, GTFukunishi, HWeber, JESweet, MJSmythe, MLFlanagan, JU Development and characterization of new inhibitors of the human and mouse hematopoietic prostaglandin D(2) synthases. J Med Chem53:5536-48 (2010) 
 
Hematopoietic prostaglandin D synthase
Name:Hematopoietic prostaglandin D synthase
Type:Enzyme
Mol. Mass.:23341.07
Organism:Homo sapiens (Human)
Description:The protein was expressed in E. coli strain BL21(DE3) with an N-terminal 6-His tag.
Residue:199
BDBM50324480
NameBDBM50324480
Synonyms:CHEMBL1215516 | N-(1-Amino-1-oxo-3-phenylpropan-2-yl)-6-(thiophen-2-yl)nicotinamide
TypeSmall organic molecule
Emp. Form.C19H17N3O2S
Mol. Mass.351.422
SMILESNC(=O)C(Cc1ccccc1)NC(=O)c1ccc(nc1)-c1cccs1