Reaction Details
TargetHematopoietic prostaglandin D synthase
LigandBDBM21625
Substrate/Competitorn/a
Meas. Tech.ChEMBL_649226 (CHEMBL1218924)
IC50 700±n/a nM
Citation Christ, ANLabzin, LBourne, GTFukunishi, HWeber, JESweet, MJSmythe, MLFlanagan, JU Development and characterization of new inhibitors of the human and mouse hematopoietic prostaglandin D(2) synthases. J Med Chem53:5536-48 (2010) 
 
Hematopoietic prostaglandin D synthase
Name:Hematopoietic prostaglandin D synthase
Type:Enzyme
Mol. Mass.:23341.07
Organism:Homo sapiens (Human)
Description:The protein was expressed in E. coli strain BL21(DE3) with an N-terminal 6-His tag.
Residue:199
BDBM21625
NameBDBM21625
Synonyms:2-phenyl-5-(1H-pyrazol-3-yl)-1,3-thiazole Pyrazolylthiazole, 13
TypeSmall organic molecule
Emp. Form.C12H9N3S
Mol. Mass.227.285
SMILESc1cc(n[nH]1)-c1cnc(s1)-c1ccccc1