Reaction Details
TargetDipeptidyl peptidase 8
LigandBDBM50324514
Substrate/Competitorn/a
Meas. Tech.ChEMBL_649273 (CHEMBL1218971)
Ki>30±n/a nM
Citation Meng, WBrigance, RPChao, HJFura, AHarrity, TMarcinkeviciene, JO'Connor, SPTamura, JKXie, DZhang, YKlei, HEKish, KWeigelt, CATurdi, HWang, AZahler, RKirby, MSHamann, LG Discovery of 6-(aminomethyl)-5-(2,4-dichlorophenyl)-7-methylimidazo[1,2-a]pyrimidine-2-carboxamides as potent, selective dipeptidyl peptidase-4 (DPP4) inhibitors. J Med Chem53:5620-8 (2010) 
 
Dipeptidyl peptidase 8
Name:Dipeptidyl peptidase 8
Type:Enzyme
Mol. Mass.:103342.62
Organism:Homo sapiens (Human)
Description:Q6V1X1
Residue:898
BDBM50324514
NameBDBM50324514
Synonyms:(+)-Ethyl 6-(aminomethyl)-5-(2,4-dichlorophenyl)-7-methylimidazo[1,2-a]pyrimidine-2-carboxylate CHEMBL1214876 rac-Ethyl 6-(Aminomethyl)-5-(2,4-dichlorophenyl)-7-methylimidazo-[1,2-a]pyrimidine-2-carboxylate
TypeSmall organic molecule
Emp. Form.C17H16Cl2N4O2
Mol. Mass.379.241
SMILESCCOC(=O)c1cn2c(c(CN)c(C)nc2n1)-c1ccc(Cl)cc1Cl