Reaction Details
TargetRetinoic acid receptor RXR-alpha
LigandBDBM50157304
Substrate/Competitorn/a
Meas. Tech.ChEMBL_649615 (CHEMBL1219313)
EC50 11800±n/a nM
Citation Kotani, HTanabe, HMizukami, HMakishima, MInoue, M Identification of a naturally occurring rexinoid, honokiol, that activates the retinoid X receptor. J Nat Prod73:1332-6 (2010) 
 
Retinoic acid receptor RXR-alpha
Name:Retinoic acid receptor RXR-alpha
Type:PROTEIN
Mol. Mass.:50820.38
Organism:Homo sapiens (Human)
Description:ChEMBL_1456363
Residue:462
BDBM50157304
NameBDBM50157304
Synonyms:3',5-di-2-propenyl-1,1'-biphenyl-2,4'-diol 5,3''-Diallyl-biphenyl-2,4''-diol CHEMBL16901 Honokiol, HO | cid_72303
TypeSmall organic molecule
Emp. Form.C18H18O2
Mol. Mass.266.3343
SMILESOc1ccc(cc1CC=C)-c1cc(CC=C)ccc1O