Reaction Details
TargetMonocarboxylate transporter 1
LigandBDBM50324668
Substrate/Competitorn/a
Meas. Tech.ChEMBL_653483 (CHEMBL1226686)
Ki 23±n/a nM
Citation Murray, CMHutchinson, RBantick, JRBelfield, GPBenjamin, ADBrazma, DBundick, RVCook, IDCraggs, RIEdwards, SEvans, LRHarrison, RHolness, EJackson, APJackson, CGKingston, LPPerry, MWRoss, ARRugman, PASidhu, SSSullivan, MTaylor-Fishwick, DAWalker, PCWhitehead, YMWilkinson, DJWright, ADonald, DK Monocarboxylate transporter MCT1 is a target for immunosuppression. Nat Chem Biol1:371-6 (2005) Monocarboxylate transporter 1
Name:Monocarboxylate transporter 1
Type:PROTEIN
Mol. Mass.:53956.64
Organism:Homo sapiens (Human)
Description:ChEMBL_1451367
Residue:500
BDBM50324668
NameBDBM50324668
Synonyms:6-[[4-azido-3-(iodo-125I)phenyl]methyl]-2,6-dihydro-2-methyl-4-(2-methylpropyl)-1H-pyrrolo[3,4-d]pyridazin-1-one | CHEMBL1221509
TypeSmall organic molecule
Emp. Form.C18H19IN6O
Mol. Mass.462.2875
SMILESCC(C)Cc1nn(C)c(=O)c2cn(Cc3ccc(N=[N+]=[N-])c(I)c3)cc12