Reaction Details
TargetProthrombin
LigandBDBM50324761
Substrate/Competitorn/a
Meas. Tech.ChEMBL_651370 (CHEMBL1227190)
Ki>25000±n/a nM
Citation Anselm, LBanner, DWBenz, JZbinden, KGHimber, JHilpert, HHuber, WKuhn, BMary, JLOtteneder, MBPanday, NRicklin, FStahl, MThomi, SHaap, W Discovery of a factor Xa inhibitor (3R,4R)-1-(2,2-difluoro-ethyl)-pyrrolidine-3,4-dicarboxylic acid 3-[(5-chloro-pyridin-2-yl)-amide] 4-[[2-fluoro-4-(2-oxo-2H-pyridin-1-yl)-phenyl]-amide] as a clinical candidate. Bioorg Med Chem Lett20:5313-9 (2010) 
 
Prothrombin
Name:Prothrombin
Type:Protein
Mol. Mass.:70029.57
Organism:Homo sapiens (Human)
Description:P00734
Residue:622
BDBM50324761
NameBDBM50324761
Synonyms:(3R,4R)-propyl 3-(4-chlorophenylcarbamoyl)-4-(2-fluoro-4-(2-oxopyridin-1(2H)-yl)phenylcarbamoyl)pyrrolidine-1-carboxylate | CHEMBL1221725
TypeSmall organic molecule
Emp. Form.C27H26ClFN4O5
Mol. Mass.540.971
SMILESCCCOC(=O)N1C[C@@H]([C@H](C1)C(=O)Nc1ccc(cc1F)-n1ccccc1=O)C(=O)Nc1ccc(Cl)cc1