Reaction Details
TargetBeta-2 adrenergic receptor
LigandBDBM86453
Substrate/Competitorn/a
Meas. Tech.ChEMBL_651475 (CHEMBL1227592)
Ki 2.6±n/a nM
Citation Beattie, DBradley, MBrearley, ACharlton, SJCuenoud, BMFairhurst, RAGedeck, PGosling, MJanus, DJones, DLewis, CMcCarthy, COakman, HStringer, RTaylor, RJTuffnell, A A physical properties based approach for the exploration of a 4-hydroxybenzothiazolone series of beta2-adrenoceptor agonists as inhaled long-acting bronchodilators. Bioorg Med Chem Lett20:5302-7 (2010) 
 
Beta-2 adrenergic receptor
Name:Beta-2 adrenergic receptor
Type:n/a
Mol. Mass.:46461.69
Organism:Homo sapiens (Human)
Description:P07550
Residue:413
BDBM86453
NameBDBM86453
Synonyms:CAS_73573-87-2 NSC_3083544
TypeSmall organic molecule
Emp. Form.C19H24N2O4
Mol. Mass.344.4049
SMILESCOc1ccc(CC(C)NCC(O)c2ccc(O)c(NC=O)c2)cc1