Reaction Details
TargetBeta-2 adrenergic receptor
LigandBDBM50324829
Substrate/Competitorn/a
Meas. Tech.ChEMBL_651475 (CHEMBL1227592)
Ki 40±n/a nM
Citation Beattie, DBradley, MBrearley, ACharlton, SJCuenoud, BMFairhurst, RAGedeck, PGosling, MJanus, DJones, DLewis, CMcCarthy, COakman, HStringer, RTaylor, RJTuffnell, A A physical properties based approach for the exploration of a 4-hydroxybenzothiazolone series of beta2-adrenoceptor agonists as inhaled long-acting bronchodilators. Bioorg Med Chem Lett20:5302-7 (2010) 
 
Beta-2 adrenergic receptor
Name:Beta-2 adrenergic receptor
Type:n/a
Mol. Mass.:46461.69
Organism:Homo sapiens (Human)
Description:P07550
Residue:413
BDBM50324829
NameBDBM50324829
Synonyms:4-hydroxy-7-((R)-1-hydroxy-2-((1S,2S,4R)-1,7,7-trimethylbicyclo[2.2.1]heptan-2-ylamino)ethyl)benzo[d]thiazol-2(3H)-one | CHEMBL1221734
TypeSmall organic molecule
Emp. Form.C19H26N2O3S
Mol. Mass.362.486
SMILESCC1(C)[C@@H]2CC[C@]1(C)[C@H](C2)NC[C@H](O)c1ccc(O)c2[nH]c(=O)sc12