Reaction Details
TargetBeta-1 adrenergic receptor
LigandBDBM50324846
Substrate/Competitorn/a
Meas. Tech.ChEMBL_651476 (CHEMBL1227593)
Ki 2±n/a nM
Citation Beattie, DBradley, MBrearley, ACharlton, SJCuenoud, BMFairhurst, RAGedeck, PGosling, MJanus, DJones, DLewis, CMcCarthy, COakman, HStringer, RTaylor, RJTuffnell, A A physical properties based approach for the exploration of a 4-hydroxybenzothiazolone series of beta2-adrenoceptor agonists as inhaled long-acting bronchodilators. Bioorg Med Chem Lett20:5302-7 (2010) 
 
Beta-1 adrenergic receptor
Name:Beta-1 adrenergic receptor
Type:G Protein-Coupled Receptor (GPCR)
Mol. Mass.:51338.40
Organism:Homo sapiens (Human)
Description:P08588
Residue:477
BDBM50324846
NameBDBM50324846
Synonyms:(R)-4-hydroxy-7-(1-hydroxy-2-(3-phenylpropylamino)ethyl)benzo[d]thiazol-2(3H)-one | CHEMBL1221589
TypeSmall organic molecule
Emp. Form.C18H20N2O3S
Mol. Mass.344.428
SMILESO[C@@H](CNCCCc1ccccc1)c1ccc(O)c2[nH]c(=O)sc12