Reaction Details
TargetBeta-1 adrenergic receptor
LigandBDBM50324854
Substrate/Competitorn/a
Meas. Tech.ChEMBL_651476 (CHEMBL1227593)
Ki 0.900000±n/a nM
Citation Beattie, DBradley, MBrearley, ACharlton, SJCuenoud, BMFairhurst, RAGedeck, PGosling, MJanus, DJones, DLewis, CMcCarthy, COakman, HStringer, RTaylor, RJTuffnell, A A physical properties based approach for the exploration of a 4-hydroxybenzothiazolone series of beta2-adrenoceptor agonists as inhaled long-acting bronchodilators. Bioorg Med Chem Lett20:5302-7 (2010) 
 
Beta-1 adrenergic receptor
Name:Beta-1 adrenergic receptor
Type:G Protein-Coupled Receptor (GPCR)
Mol. Mass.:51338.40
Organism:Homo sapiens (Human)
Description:P08588
Residue:477
BDBM50324854
NameBDBM50324854
Synonyms:7-((R)-2-((1R,2R)-2-(benzyloxy)cyclopentylamino)-1-hydroxyethyl)-4-hydroxybenzo[d]thiazol-2(3H)-one | CHEMBL1221680
TypeSmall organic molecule
Emp. Form.C21H24N2O4S
Mol. Mass.400.491
SMILESO[C@@H](CN[C@@H]1CCC[C@H]1OCc1ccccc1)c1ccc(O)c2[nH]c(=O)sc12