Reaction Details
TargetCollagenase 3
LigandBDBM50325340
Substrate/Competitorn/a
Meas. Tech.ChEMBL_652122 (CHEMBL1228231)
IC50 6±n/a nM
Citation Gao, DAXiong, ZHeim-Riether, AAmodeo, LAugust, EMCao, XCiccarelli, LCollins, BKHarrington, KHaverty, KHill-Drzewi, MLi, XLiang, SMargarit, SMMoss, NNagaraja, NProudfoot, JRoman, RSchlyer, SKeenan, LSTaylor, SWellenzohn, BWiedenmayer, DLi, JFarrow, NA SAR studies of non-zinc-chelating MMP-13 inhibitors: improving selectivity and metabolic stability. Bioorg Med Chem Lett20:5039-43 (2010) 
 
Collagenase 3
Name:Collagenase 3
Type:Enzyme
Mol. Mass.:53808.06
Organism:Homo sapiens (Human)
Description:P45452
Residue:471
BDBM50325340
NameBDBM50325340
Synonyms:(S)-N-(3-(5-(3-methyl-1-(methylamino)-1-oxobutan-2-ylcarbamoyl)furan-2-yl)benzyl)-6-(trifluoromethyl)picolinamide | CHEMBL1223422
TypeSmall organic molecule
Emp. Form.C25H25F3N4O4
Mol. Mass.502.4856
SMILESCNC(=O)[C@@H](NC(=O)c1ccc(o1)-c1cccc(CNC(=O)c2cccc(n2)C(F)(F)F)c1)C(C)C