Reaction Details
TargetProstaglandin G/H synthase 1
LigandBDBM17638
Substrate/Competitorn/a
Meas. Tech.ChEMBL_652314 (CHEMBL1225517)
IC50 69±n/a nM
Citation Eren, GUnlü, SNuñez, MTLabeaga, LLedo, FEntrena, ABanoglu, ECostantino, GSahin, MF Synthesis, biological evaluation, and docking studies of novel heterocyclic diaryl compounds as selective COX-2 inhibitors. Bioorg Med Chem18:6367-76 (2010) 
 
Prostaglandin G/H synthase 1
Name:Prostaglandin G/H synthase 1
Type:Protein
Mol. Mass.:68868.60
Organism:Ovis aries (Sheep)
Description:n/a
Residue:600
BDBM17638
NameBDBM17638
Synonyms:2-{1-[(4-chlorophenyl)carbonyl]-5-methoxy-2-methyl-1H-indol-3-yl}acetic acid Indocin US11478464, Compound Indomethacin US9271961, Indomethacin | indometacin
TypeSmall organic molecule
Emp. Form.C19H16ClNO4
Mol. Mass.357.788
SMILESCOc1ccc2n(C(=O)c3ccc(Cl)cc3)c(C)c(CC(O)=O)c2c1