Reaction Details
TargetProstaglandin G/H synthase 2
LigandBDBM50325644
Substrate/Competitorn/a
Meas. Tech.ChEMBL_652313 (CHEMBL1225516)
IC50 11±n/a nM
Citation Eren, GUnlü, SNuñez, MTLabeaga, LLedo, FEntrena, ABanoglu, ECostantino, GSahin, MF Synthesis, biological evaluation, and docking studies of novel heterocyclic diaryl compounds as selective COX-2 inhibitors. Bioorg Med Chem18:6367-76 (2010) 
 
Prostaglandin G/H synthase 2
Name:Prostaglandin G/H synthase 2
Type:Protein
Mol. Mass.:68976.98
Organism:Ovis aries (Sheep)
Description:n/a
Residue:603
BDBM50325644
NameBDBM50325644
Synonyms:1-(4-Chlorophenyl)-3-trifluoromethyl-5-(3-methyl-2-oxo-3H-benzoxazole-6-yl)-1H-pyrazole | CHEMBL1224098
TypeSmall organic molecule
Emp. Form.C18H11ClF3N3O2
Mol. Mass.393.747
SMILESCn1c2ccc(cc2oc1=O)-c1cc(nn1-c1ccc(Cl)cc1)C(F)(F)F