Reaction Details
TargetKappa-type opioid receptor
LigandBDBM50325850
Substrate/Competitorn/a
Meas. Tech.ChEMBL_652658 (CHEMBL1225861)
IC50 1301±n/a nM
Citation Brugel, TASmith, RWBalestra, MBecker, CDaniels, TKoether, GMThroner, SRPanko, LMBrown, DGLiu, RGordon, JPeters, MF SAR development of a series of 8-azabicyclo[3.2.1]octan-3-yloxy-benzamides as kappa opioid receptor antagonists. Part 2. Bioorg Med Chem Lett20:5405-10 (2010) 
 
Kappa-type opioid receptor
Name:Kappa-type opioid receptor
Type:G Protein-Coupled Receptor (GPCR)
Mol. Mass.:42648.76
Organism:Homo sapiens (Human)
Description:P41145
Residue:380
BDBM50325850
NameBDBM50325850
Synonyms:CHEMBL1223817 | trans-3-((1R,3R,5S)-8-(((4R)-4-(3,3-dimethylureido)cyclohexyl)methyl)-8-azabicyclo[3.2.1]octan-3-yloxy)benzamide
TypeSmall organic molecule
Emp. Form.C24H36N4O3
Mol. Mass.428.5676
SMILESCN(C)C(=O)N[C@H]1CC[C@H](CN2[C@H]3CC[C@@H]2C[C@@H](C3)Oc2cccc(c2)C(N)=O)CC1