Reaction Details
TargetKappa-type opioid receptor
LigandBDBM50325859
Substrate/Competitorn/a
Meas. Tech.ChEMBL_652658 (CHEMBL1225861)
IC50 8242±n/a nM
Citation Brugel, TASmith, RWBalestra, MBecker, CDaniels, TKoether, GMThroner, SRPanko, LMBrown, DGLiu, RGordon, JPeters, MF SAR development of a series of 8-azabicyclo[3.2.1]octan-3-yloxy-benzamides as kappa opioid receptor antagonists. Part 2. Bioorg Med Chem Lett20:5405-10 (2010) 
 
Kappa-type opioid receptor
Name:Kappa-type opioid receptor
Type:G Protein-Coupled Receptor (GPCR)
Mol. Mass.:42648.76
Organism:Homo sapiens (Human)
Description:P41145
Residue:380
BDBM50325859
NameBDBM50325859
Synonyms:CHEMBL1223955 | endo-3-((R)-((1R,5S)-8-benzyl-8-azabicyclo[3.2.1]octan-3-yl)sulfinyl)benzamide
TypeSmall organic molecule
Emp. Form.C21H24N2O2S
Mol. Mass.368.492
SMILESNC(=O)c1cccc(c1)S(=O)[C@@H]1C[C@@H]2CC[C@H](C1)N2Cc1ccccc1