Reaction Details
TargetKappa-type opioid receptor
LigandBDBM50325866
Substrate/Competitorn/a
Meas. Tech.ChEMBL_652658 (CHEMBL1225861)
IC50 222±n/a nM
Citation Brugel, TASmith, RWBalestra, MBecker, CDaniels, TKoether, GMThroner, SRPanko, LMBrown, DGLiu, RGordon, JPeters, MF SAR development of a series of 8-azabicyclo[3.2.1]octan-3-yloxy-benzamides as kappa opioid receptor antagonists. Part 2. Bioorg Med Chem Lett20:5405-10 (2010) 
 
Kappa-type opioid receptor
Name:Kappa-type opioid receptor
Type:G Protein-Coupled Receptor (GPCR)
Mol. Mass.:42648.76
Organism:Homo sapiens (Human)
Description:P41145
Residue:380
BDBM50325866
NameBDBM50325866
Synonyms:CHEMBL1224139 | endo-3-((1R,5S)-8-benzyl-8-azabicyclo[3.2.1]octan-3-yloxy)-5-fluorobenzamide
TypeSmall organic molecule
Emp. Form.C21H23FN2O2
Mol. Mass.354.4179
SMILESNC(=O)c1cc(F)cc(O[C@@H]2C[C@@H]3CC[C@H](C2)N3Cc2ccccc2)c1