Reaction Details
TargetMu-type opioid receptor
LigandBDBM50325867
Substrate/Competitorn/a
Meas. Tech.ChEMBL_652659 (CHEMBL1225862)
IC50 17039±n/a nM
Citation Brugel, TASmith, RWBalestra, MBecker, CDaniels, TKoether, GMThroner, SRPanko, LMBrown, DGLiu, RGordon, JPeters, MF SAR development of a series of 8-azabicyclo[3.2.1]octan-3-yloxy-benzamides as kappa opioid receptor antagonists. Part 2. Bioorg Med Chem Lett20:5405-10 (2010) 
 
Mu-type opioid receptor
Name:Mu-type opioid receptor
Type:G Protein-Coupled Receptor (GPCR)
Mol. Mass.:44789.51
Organism:Homo sapiens (Human)
Description:P35372
Residue:400
BDBM50325867
NameBDBM50325867
Synonyms:CHEMBL1224140 | endo-3-((1R,5S)-8-benzyl-8-azabicyclo[3.2.1]octan-3-yloxy)-5-methylbenzamide
TypeSmall organic molecule
Emp. Form.C22H26N2O2
Mol. Mass.350.454
SMILESCc1cc(O[C@@H]2C[C@@H]3CC[C@H](C2)N3Cc2ccccc2)cc(c1)C(N)=O