Reaction Details
TargetPotassium voltage-gated channel subfamily H member 2
LigandBDBM50325851
Substrate/Competitorn/a
Meas. Tech.ChEMBL_652661 (CHEMBL1225864)
IC50>33000±n/a nM
Citation Brugel, TASmith, RWBalestra, MBecker, CDaniels, TKoether, GMThroner, SRPanko, LMBrown, DGLiu, RGordon, JPeters, MF SAR development of a series of 8-azabicyclo[3.2.1]octan-3-yloxy-benzamides as kappa opioid receptor antagonists. Part 2. Bioorg Med Chem Lett20:5405-10 (2010) 
 
Potassium voltage-gated channel subfamily H member 2
Name:Potassium voltage-gated channel subfamily H member 2
Type:Multi-pass membrane protein
Mol. Mass.:126672.65
Organism:Homo sapiens (Human)
Description:Q12809
Residue:1159
BDBM50325851
NameBDBM50325851
Synonyms:CHEMBL1223870 | trans-3-((1R,3R,5S)-8-(2-((4R)-4-(3,3-dimethylureido)cyclohexyl)ethyl)-8-azabicyclo[3.2.1]octan-3-yloxy)benzamide
TypeSmall organic molecule
Emp. Form.C25H38N4O3
Mol. Mass.442.5942
SMILESCN(C)C(=O)N[C@H]1CC[C@H](CCN2[C@H]3CC[C@@H]2C[C@@H](C3)Oc2cccc(c2)C(N)=O)CC1