Reaction Details
TargetPotassium voltage-gated channel subfamily H member 2
LigandBDBM50325873
Substrate/Competitorn/a
Meas. Tech.ChEMBL_652661 (CHEMBL1225864)
IC50 1300±n/a nM
Citation Brugel, TASmith, RWBalestra, MBecker, CDaniels, TKoether, GMThroner, SRPanko, LMBrown, DGLiu, RGordon, JPeters, MF SAR development of a series of 8-azabicyclo[3.2.1]octan-3-yloxy-benzamides as kappa opioid receptor antagonists. Part 2. Bioorg Med Chem Lett20:5405-10 (2010) 
 
Potassium voltage-gated channel subfamily H member 2
Name:Potassium voltage-gated channel subfamily H member 2
Type:Multi-pass membrane protein
Mol. Mass.:126672.65
Organism:Homo sapiens (Human)
Description:Q12809
Residue:1159
BDBM50325873
NameBDBM50325873
Synonyms:CHEMBL1224217 | endo-6-((1R,5S)-8-benzyl-8-azabicyclo[3.2.1]octan-3-yloxy)nicotinamide
TypeSmall organic molecule
Emp. Form.C20H23N3O2
Mol. Mass.337.4155
SMILESNC(=O)c1ccc(O[C@@H]2C[C@@H]3CC[C@H](C2)N3Cc2ccccc2)nc1