Reaction Details
TargetHydroxycarboxylic acid receptor 2
LigandBDBM50325899
Substrate/Competitorn/a
Meas. Tech.ChEMBL_654086 (CHEMBL1228892)
EC50 60±n/a nM
Citation Peters, JUKühne, HDehmlow, HGrether, UConte, AHainzl, DHertel, CKratochwil, NAOtteneder, MNarquizian, RPanousis, CGRicklin, FRöver, S Pyrido pyrimidinones as selective agonists of the high affinity niacin receptor GPR109A: optimization of in vitro activity. Bioorg Med Chem Lett20:5426-30 (2010) 
 
Hydroxycarboxylic acid receptor 2
Name:Hydroxycarboxylic acid receptor 2
Type:PROTEIN
Mol. Mass.:41476.06
Organism:Rattus norvegicus
Description:ChEMBL_820675
Residue:360
BDBM50325899
NameBDBM50325899
Synonyms:2-(trifluoromethyl)pyrido[2,3-d]pyrimidin-4(3H)-one | CHEMBL1223819
TypeSmall organic molecule
Emp. Form.C8H4F3N3O
Mol. Mass.215.1321
SMILESFC(F)(F)c1nc2ncccc2c(=O)[nH]1