Reaction Details
TargetIndoleamine 2,3-dioxygenase 1
LigandBDBM24792
Substrate/Competitorn/a
Meas. Tech.ChEMBL_657596 (CHEMBL1247197)
IC50 2000±n/a nM
Citation John, SThangapandian, SSakkiah, SLee, KW Identification of potent virtual leads to design novel indoleamine 2,3-dioxygenase inhibitors: pharmacophore modeling and molecular docking studies. Eur J Med Chem45:4004-12 (2010) 
 
Indoleamine 2,3-dioxygenase 1
Name:Indoleamine 2,3-dioxygenase 1
Type:Enzyme
Mol. Mass.:45330.80
Organism:Homo sapiens (Human)
Description:P14902
Residue:403
BDBM24792
NameBDBM24792
Synonyms:8-hydroxy-2,2-dimethyl-2H,5H,10H-benzo[g]chromene-5,10-dione | Pyranonaphthoquinone derivative, 29
TypeSmall organic molecule
Emp. Form.C15H12O4
Mol. Mass.256.2534
SMILESCC1(C)OC2=C(C=C1)C(=O)c1ccc(O)cc1C2=O