Reaction Details
TargetS-methyl-5'-thioadenosine phosphorylase
LigandBDBM50326410
Substrate/Competitorn/a
Meas. Tech.ChEMBL_657428 (CHEMBL1246404)
Ki 71±n/a nM
Citation Longshaw, AIAdanitsch, FGutierrez, JAEvans, GBTyler, PCSchramm, VL Design and synthesis of potent"sulfur-free" transition state analogue inhibitors of 5'-methylthioadenosine nucleosidase and 5'-methylthioadenosine phosphorylase. J Med Chem53:6730-46 (2010) 
 
S-methyl-5'-thioadenosine phosphorylase
Name:S-methyl-5'-thioadenosine phosphorylase
Type:Enzyme
Mol. Mass.:31239.23
Organism:Homo sapiens (Human)
Description:n/a
Residue:283
BDBM50326410
NameBDBM50326410
Synonyms:(+/-)-trans-4-[3-(Benzylthio)propyl]-1-[(9-deazaadenin-9-yl)-methyl]-3-hydroxypyrrolidine | CHEMBL1243341
TypeSmall organic molecule
Emp. Form.C21H27N5OS
Mol. Mass.397.537
SMILESNc1ncnc2c(CN3C[C@H](O)[C@@H](CCCSCc4ccccc4)C3)c[nH]c12