Reaction Details
TargetS-methyl-5'-thioadenosine phosphorylase
LigandBDBM50326411
Substrate/Competitorn/a
Meas. Tech.ChEMBL_657428 (CHEMBL1246404)
Ki 34±n/a nM
Citation Longshaw, AIAdanitsch, FGutierrez, JAEvans, GBTyler, PCSchramm, VL Design and synthesis of potent"sulfur-free" transition state analogue inhibitors of 5'-methylthioadenosine nucleosidase and 5'-methylthioadenosine phosphorylase. J Med Chem53:6730-46 (2010) 
 
S-methyl-5'-thioadenosine phosphorylase
Name:S-methyl-5'-thioadenosine phosphorylase
Type:Enzyme
Mol. Mass.:31239.23
Organism:Homo sapiens (Human)
Description:n/a
Residue:283
BDBM50326411
NameBDBM50326411
Synonyms:(+/-)-Benzyl cis-3-(Benzoyloxy)-4-ethylpyrrolidine-1-carboxylate | CHEMBL1241432
TypeSmall organic molecule
Emp. Form.C13H19N5O
Mol. Mass.261.3229
SMILESCC[C@H]1CN(Cc2c[nH]c3c(N)ncnc23)C[C@H]1O