Reaction Details
TargetSerine/threonine-protein kinase Sgk1
LigandBDBM50298223
Substrate/Competitorn/a
Meas. Tech.ChEMBL_657459 (CHEMBL1246571)
IC50 2700±n/a nM
Citation Oyarzabal, JZarich, NAlbarran, MIPalacios, IUrbano-Cuadrado, MMateos, GReymundo, IRabal, OSalgado, ACorrionero, AFominaya, JPastor, JBischoff, JR Discovery of mitogen-activated protein kinase-interacting kinase 1 inhibitors by a comprehensive fragment-oriented virtual screening approach. J Med Chem53:6618-28 (2010) 
 
Serine/threonine-protein kinase Sgk1
Name:Serine/threonine-protein kinase Sgk1
Type:Other Protein Type
Mol. Mass.:48954.40
Organism:Homo sapiens (Human)
Description:Recombinant human SGK-1 enzyme produced in a baculovirus system.
Residue:431
BDBM50298223
NameBDBM50298223
Synonyms:CGP-57380 CHEMBL576817 | N-(4-fluorophenyl)-3H-pyrazolo[3,4-d]pyrimidine-3,4-diamine
TypeSmall organic molecule
Emp. Form.C11H9FN6
Mol. Mass.244.2278
SMILESNc1ncnc2n[nH]c(Nc3ccc(F)cc3)c12