Reaction Details
TargetBeta-2 adrenergic receptor
LigandBDBM50326536
Substrate/Competitorn/a
Meas. Tech.ChEMBL_658303 (CHEMBL1246860)
EC50 0.37±n/a nM
Citation Glossop, PALane, CAPrice, DABunnage, MELewthwaite, RAJames, KBrown, ADYeadon, MPerros-Huguet, CTrevethick, MAClarke, NPWebster, RJones, RMBurrows, JLFeeder, NTaylor, SCSpence, FJ Inhalation by design: novel ultra-long-actingß(2)-adrenoreceptor agonists for inhaled once-daily treatment of asthma and chronic obstructive pulmonary disease that utilize a sulfonamide agonist headgroup. J Med Chem53:6640-52 (2010) 
 
Beta-2 adrenergic receptor
Name:Beta-2 adrenergic receptor
Type:n/a
Mol. Mass.:46461.69
Organism:Homo sapiens (Human)
Description:P07550
Residue:413
BDBM50326536
NameBDBM50326536
Synonyms:(R)-N-(2-chloro-4-hydroxybenzyl)-N-ethyl-2-(3-(2-(2-hydroxy-2-(4-hydroxy-3-(methylsulfonamido)phenyl)ethylamino)-2-methylpropyl)phenyl)acetamide | CHEMBL1242969
TypeSmall organic molecule
Emp. Form.C30H38ClN3O6S
Mol. Mass.604.157
SMILESCCN(Cc1ccc(O)cc1Cl)C(=O)Cc1cccc(CC(C)(C)NC[C@H](O)c2ccc(O)c(NS(C)(=O)=O)c2)c1