Reaction Details
TargetBeta-2 adrenergic receptor
LigandBDBM50326546
Substrate/Competitorn/a
Meas. Tech.ChEMBL_658303 (CHEMBL1246860)
EC50 0.06±n/a nM
Citation Glossop, PALane, CAPrice, DABunnage, MELewthwaite, RAJames, KBrown, ADYeadon, MPerros-Huguet, CTrevethick, MAClarke, NPWebster, RJones, RMBurrows, JLFeeder, NTaylor, SCSpence, FJ Inhalation by design: novel ultra-long-actingß(2)-adrenoreceptor agonists for inhaled once-daily treatment of asthma and chronic obstructive pulmonary disease that utilize a sulfonamide agonist headgroup. J Med Chem53:6640-52 (2010) 
 
Beta-2 adrenergic receptor
Name:Beta-2 adrenergic receptor
Type:n/a
Mol. Mass.:46461.69
Organism:Homo sapiens (Human)
Description:P07550
Residue:413
BDBM50326546
NameBDBM50326546
Synonyms:CHEMBL402501 | N-adamantan-1-yl-2-(3-{(R)-2-[(R)-2-hydroxy-2-(4-hydroxy-3-hydroxymethyl-phenyl)-ethylamino]-propyl}-phenyl)-acetamide
TypeSmall organic molecule
Emp. Form.C30H40N2O4
Mol. Mass.492.6496
SMILESC[C@H](Cc1cccc(CC(=O)NC23CC4CC(CC(C4)C2)C3)c1)NC[C@H](O)c1ccc(O)c(CO)c1