Reaction Details
TargetCytochrome c oxidase subunit 1
LigandBDBM50326828
Substrate/Competitorn/a
Meas. Tech.ChEMBL_662814 (CHEMBL1252214)
IC50 15900±n/a nM
Citation Zarghi, AGhodsi, R Design, synthesis, and biological evaluation of ketoprofen analogs as potent cyclooxygenase-2 inhibitors. Bioorg Med Chem18:5855-60 (2010) 
 
Cytochrome c oxidase subunit 1
Name:Cytochrome c oxidase subunit 1
Type:PROTEIN
Mol. Mass.:57042.19
Organism:Ovis aries
Description:ChEMBL_662814
Residue:514
BDBM50326828
NameBDBM50326828
Synonyms:8-benzoyl-2-(4-(methylsulfonyl)phenyl)quinoline-4-carboxylic acid | CHEMBL1254784
TypeSmall organic molecule
Emp. Form.C24H17NO5S
Mol. Mass.431.46
SMILESCS(=O)(=O)c1ccc(cc1)-c1cc(C(O)=O)c2cccc(C(=O)c3ccccc3)c2n1