Reaction Details
TargetCytochrome c oxidase subunit 1
LigandBDBM50326830
Substrate/Competitorn/a
Meas. Tech.ChEMBL_662814 (CHEMBL1252214)
IC50 65550±n/a nM
Citation Zarghi, AGhodsi, R Design, synthesis, and biological evaluation of ketoprofen analogs as potent cyclooxygenase-2 inhibitors. Bioorg Med Chem18:5855-60 (2010) 
 
Cytochrome c oxidase subunit 1
Name:Cytochrome c oxidase subunit 1
Type:PROTEIN
Mol. Mass.:57042.19
Organism:Ovis aries
Description:ChEMBL_662814
Residue:514
BDBM50326830
NameBDBM50326830
Synonyms:2-(4-azido)phenyl)-8-benzoyl-quinoline-4-carboxylic acid | CHEMBL1254872
TypeSmall organic molecule
Emp. Form.C23H14N4O3
Mol. Mass.394.3823
SMILESOC(=O)c1cc(nc2c(cccc12)C(=O)c1ccccc1)-c1ccc(cc1)N=[N+]=[N-]