Reaction Details
TargetSodium-dependent dopamine transporter
LigandBDBM50327148
Substrate/Competitorn/a
Meas. Tech.ChEMBL_663804 (CHEMBL1250704)
IC50 14±n/a nM
Citation Misra, MShi, QYe, XGruszecka-Kowalik, EBu, WLiu, ZSchweri, MMDeutsch, HMVenanzi, CA Quantitative structure-activity relationship studies of threo-methylphenidate analogs. Bioorg Med Chem18:7221-38 (2010) 
 
Sodium-dependent dopamine transporter
Name:Sodium-dependent dopamine transporter
Type:Multi-pass membrane protein
Mol. Mass.:68749.45
Organism:Rattus norvegicus (rat)
Description:P23977
Residue:619
BDBM50327148
NameBDBM50327148
Synonyms:(R)-methyl 2-(4-iodophenyl)-2-((R)-piperidin-2-yl)acetate | CHEMBL1253735
TypeSmall organic molecule
Emp. Form.C14H18INO2
Mol. Mass.359.2027
SMILESCOC(=O)[C@@H]([C@H]1CCCCN1)c1ccc(I)cc1