Reaction Details
TargetRenin
LigandBDBM50325178
Substrate/Competitorn/a
Meas. Tech.ChEMBL_664344 (CHEMBL1259493)
IC50 0.09±n/a nM
Citation Lacombe, PAspiotis, RBayly, CChen, ADubé, DFortin, RGallant, MJuteau, HLiu, SMcKay, DRoy, PWu, T Identification of a new biaryl scaffold generating potent renin inhibitors. Bioorg Med Chem Lett20:5822-6 (2010) 
 
Renin
Name:Renin
Type:Enzyme
Mol. Mass.:45058.99
Organism:Homo sapiens (Human)
Description:n/a
Residue:406
BDBM50325178
NameBDBM50325178
Synonyms:(R)-3-amino-N-(2-chloro-5-(3-methoxypropyl)benzyl)-N-cyclopropyl-2-(4-(2-(2,6-dichloro-4-methylphenoxy)ethoxy)benzyl)propanamide | CHEMBL1222884
TypeSmall organic molecule
Emp. Form.C33H39Cl3N2O4
Mol. Mass.634.033
SMILESCOCCCc1ccc(Cl)c(CN(C2CC2)C(=O)[C@@H](CN)Cc2ccc(OCCOc3c(Cl)cc(C)cc3Cl)cc2)c1